{"text_format":"1","workbook":"xlsx","n_sheets":7,"sheets":["INQUADRAMENTO","GENERALITÀ","MORFOLOGIAePROCESSI","ARTIFICIALITÀ","VARIAZIONI MORFOLOGICHE","CALC_INDICI","SINTESI"],"not_rendered":{"charts":0,"images":0,"macros":1,"external_links":0,"defined_names":9,"comments":0,"pivot_tables":0},"unopened":[],"bounds":{"document_bytes":16777216,"sheet_cells":100000,"rows_first":2000,"rows_last":500,"rows_between":2000,"halvings":0,"cell_chars":16384,"cell_head_chars":4096},"cells_cut":0,"cells_raw":0,"read":"whole","date_system":"1904"}

{"sheet":"INQUADRAMENTO","index":0,"n_rows":54,"n_cols":9,"rows_kept":54,"cut":false,"hidden":false,"merged":[[51,0,51,9],[53,6,53,9],[2,1,2,3],[3,1,3,3],[1,1,1,3],[1,4,1,8],[2,4,2,8],[3,4,3,8],[50,0,50,9],[37,0,38,8]]}
[]
[null,"TRATTO",null,null,{"$f":"IF(GENERALITÀ!F10=\"\",\"---\",GENERALITÀ!F10)","v":"TR_9_3_1"}]
[null,"BACINO",null,null,{"$f":"IF(GENERALITÀ!C8=\"\",\"---\",GENERALITÀ!C8)","v":"Fiume a confluenza 1"}]
[null,"CORSO D'ACQUA",null,null,{"$f":"IF(GENERALITÀ!F8=\"\",\"---\",GENERALITÀ!F8)","v":"Fiume"}]
[]
[]
[]
[]
[]
[]
[]
[]
[]
[]
[]
[]
[null,null,null,null,"immagine"]
[]
[]
[]
[]
[]
[]
[]
[]
[]
[]
[]
[]
[]
[]
[]
[]
[]
[]
[]
[]
["SCHEDA  DI VALUTAZIONE DELLA DINAMICA MORFOLOGICA"]
[]
[]
[]
[]
[]
[]
[]
[]
[null,null,null,null,null,null,null,"ANNO:",{"$f":"IF(YEAR(GENERALITÀ!C7)<2000,\"---\",YEAR(GENERALITÀ!C7))","v":2015}]
[]
[]
[]
["IDRAIM"]
["sistema di valutazione IDRomorfologica, AnalisI e Monitoraggio dei Corsi d'Acqua"]
[]
[null,null,null,null,null,null,"Versione IDM 1.0 - Settembre 2015"]

{"sheet":"GENERALITÀ","index":1,"n_rows":29,"n_cols":7,"rows_kept":29,"cut":false,"hidden":false,"merged":[[27,1,27,2],[27,3,27,4],[27,5,27,6],[28,1,28,2],[28,3,28,4],[28,5,28,6],[24,3,24,6],[25,3,25,4],[25,5,25,6],[26,1,26,2],[26,3,26,4],[26,5,26,6],[24,1,25,2],[22,1,22,2],[21,3,21,4],[22,3,22,4],[21,5,21,6],[22,5,22,6],[19,1,20,2],[19,3,19,6],[21,1,21,2],[14,4,14,5],[20,5,20,6],[20,3,20,4],[10,2,10,3],[12,1,12,6],[17,1,17,6],[15,4,15,5],[1,1,2,6],[6,2,6,3],[7,2,7,3],[8,2,8,3],[4,1,4,6],[9,2,9,3],[9,5,9,6],[6,5,6,6],[7,5,7,6],[8,5,8,6]]}
[]
[null,"IDM - SCHEDA  DI VALUTAZIONE DELLA DINAMICA MORFOLOGICA"]
[]
[]
[null,"GENERALITÀ"]
[]
[null,"Data","2015-03-08",null,"Operatori","Rossi e Bianchi"]
[null,"Bacino","Fiume a confluenza 1",null,"Corso d'acqua","Fiume"]
[null,"Estremità monte","confluenza 1",null,"Estremità valle","confluenza 2"]
[null,"Codice Segmento","SEG_9_3",null,"Codice Tratto","TR_9_3_1"]
[null,"Lunghezza tratto (m) - Lt",2520]
[]
[null,"TIPOLOGIA D'ALVEO"]
[]
[null,"Confinamento","SC",null,"Pendenza media fondo (S)",null,2E-3]
[null,"Morfologia","S",null,"Larghezza media alveo (m) - La",null,60]
[]
[null,"DATI UTILIZZATI"]
[]
[null,"Immagini",null,"per situazione attuale e tendenze laterali"]
[null,null,null,"nome",null,"anno"]
[null,"Immagine situazione attuale",null,"Volo XX",null,2014]
[null,"Immagine ultimi 10-20 anni",null,"Volo YY",null,2000]
[]
[null,"Rilievi topografici",null,"per tendenze e variazioni altimetriche"]
[null,null,null,"nome",null,"anno"]
[null,"Attuale",null,"Rilievo XX",null,2013]
[null,"Ultimi 10-20 anni",null,"Rilievo YY",null,2002]
[null,"Precedente",null,"Rilievo ZZ",null,1990]

{"sheet":"MORFOLOGIAePROCESSI","index":2,"n_rows":136,"n_cols":20,"rows_kept":136,"cut":false,"hidden":false,"merged":[[123,1,123,5],[124,0,125,0],[124,1,125,5],[124,6,125,6],[129,13,134,13],[130,0,131,0],[130,1,131,5],[130,6,131,6],[130,7,131,7],[131,8,132,8],[131,9,132,9],[132,0,133,0],[132,1,133,5],[132,6,133,6],[125,13,126,13],[126,0,127,0],[126,1,127,5],[126,6,127,6],[126,7,127,7],[127,8,128,8],[127,9,128,9],[127,13,128,13],[128,0,129,0],[128,1,129,5],[124,7,125,7],[124,10,133,12],[125,8,126,8],[125,9,126,9],[128,6,129,6],[128,7,129,7],[132,7,133,7],[129,8,130,8],[129,9,130,9],[115,6,116,6],[115,7,116,7],[116,8,117,8],[116,9,117,9],[117,0,118,0],[117,1,118,5],[117,6,118,6],[117,7,118,7],[112,13,113,13],[113,0,114,0],[113,1,114,5],[113,6,114,6],[113,7,114,7],[114,8,115,8],[114,9,115,9],[114,13,119,13],[115,0,116,0],[115,1,116,5],[109,10,118,12],[110,8,111,8],[110,9,111,9],[110,13,111,13],[111,0,112,0],[111,1,112,5],[111,6,112,6],[111,7,112,7],[112,8,113,8],[112,9,113,9],[108,1,108,5],[109,0,110,0],[109,1,110,5],[109,6,110,6],[109,7,110,7],[18,1,19,5],[77,0,78,0],[77,1,78,5],[77,6,78,6],[77,7,78,7],[106,0,106,9],[62,6,63,6],[61,9,62,9],[38,9,39,9],[59,9,60,9],[62,7,63,7],[69,6,70,6],[69,7,70,7],[61,8,62,8],[73,0,74,0],[73,1,74,5],[73,6,74,6],[58,0,59,0],[58,1,59,5],[58,6,59,6],[58,7,59,7],[59,8,60,8],[43,7,44,7],[75,6,76,6],[62,0,63,0],[62,1,63,5],[39,7,40,7],[54,6,55,6],[60,6,61,6],[36,1,36,5],[37,0,38,0],[37,1,38,5],[37,6,38,6],[45,0,46,0],[45,1,46,5],[45,6,46,6],[39,6,40,6],[43,1,44,5],[43,6,44,6],[60,13,61,13],[62,13,63,13],[41,13,42,13],[38,8,39,8],[72,8,73,8],[72,9,73,9],[69,1,70,5],[70,8,71,8],[5,13,6,13],[7,13,8,13],[9,13,10,13],[18,13,19,13],[20,13,21,13],[22,13,23,13],[5,1,6,5],[9,6,10,6],[9,7,10,7],[18,7,19,7],[9,1,10,5],[7,1,8,5],[7,6,8,6],[7,7,8,7],[37,10,46,12],[54,10,63,12],[0,0,1,9],[17,1,17,5],[6,8,7,8],[22,0,23,0],[22,6,23,6],[22,7,23,7],[20,0,21,0],[18,6,19,6],[21,8,22,8],[8,8,9,8],[22,1,23,5],[5,6,6,6],[5,7,6,7],[20,1,21,5],[20,6,21,6],[20,7,21,7],[19,8,20,8],[5,0,6,0],[9,0,10,0],[7,0,8,0],[4,1,4,5],[6,9,7,9],[8,9,9,9],[19,9,20,9],[37,13,38,13],[11,0,12,0],[11,1,12,5],[11,6,12,6],[11,7,12,7],[11,13,12,13],[10,8,11,8],[10,9,11,9],[24,7,25,7],[24,13,25,13],[26,0,27,0],[26,1,27,5],[26,6,27,6],[26,7,27,7],[26,13,27,13],[31,0,31,7],[23,8,24,8],[24,0,25,0],[24,1,25,5],[24,6,25,6],[23,9,24,9],[37,7,38,7],[21,9,22,9],[18,0,19,0],[43,13,44,13],[40,9,41,9],[42,9,43,9],[44,9,45,9],[40,8,41,8],[42,8,43,8],[44,8,45,8],[56,13,57,13],[55,8,56,8],[57,8,58,8],[55,9,56,9],[57,9,58,9],[58,13,59,13],[39,13,40,13],[45,13,46,13],[54,13,55,13],[74,13,79,13],[76,8,77,8],[76,9,77,9],[83,1,83,5],[84,0,85,0],[84,1,85,5],[84,6,85,6],[84,7,85,7],[75,0,76,0],[75,1,76,5],[74,9,75,9],[69,10,78,12],[70,13,71,13],[72,13,73,13],[70,9,71,9],[71,0,72,0],[71,1,72,5],[71,6,72,6],[71,7,72,7],[74,8,75,8],[69,0,70,0],[75,7,76,7],[87,13,88,13],[88,0,89,0],[88,1,89,5],[88,6,89,6],[88,7,89,7],[89,8,90,8],[89,13,94,13],[90,0,91,0],[84,10,93,12],[90,1,91,5],[85,8,86,8],[85,9,86,9],[85,13,86,13],[86,0,87,0],[86,1,87,5],[86,6,87,6],[86,7,87,7],[87,9,88,9],[18,10,27,12],[5,10,12,12],[90,6,91,6],[90,7,91,7],[91,8,92,8],[91,9,92,9],[89,9,90,9],[87,8,88,8],[120,0,121,8],[92,6,93,6],[92,7,93,7],[73,7,74,7],[25,8,26,8],[25,9,26,9],[41,0,42,0],[41,1,42,5],[41,6,42,6],[41,7,42,7],[28,0,28,7],[29,0,29,7],[30,0,30,7],[43,0,44,0],[54,7,55,7],[60,7,61,7],[135,0,136,8],[14,0,15,8],[33,0,34,8],[50,0,51,8],[65,0,66,8],[80,0,81,8],[95,0,96,8],[92,0,93,0],[92,1,93,5],[60,1,61,5],[45,7,46,7],[47,0,47,7],[48,0,48,7],[56,0,57,0],[56,1,57,5],[56,6,57,6],[56,7,57,7],[53,1,53,5],[54,0,55,0],[54,1,55,5],[60,0,61,0],[39,0,40,0],[39,1,40,5],[68,1,68,5]]}
["MORFOLOGIA E PROCESSI"]
[]
[]
[null,null,null,null,null,null,null,null,null,null,null,null,null,null,"SM tot","Sna(M)","Max(SMtot)","conf","Mmax","Mmin"]
["M1","Tipologia d'alveo",null,null,null,null,"pt","scelta","conf","ptconf",null,null,null,{"$f":"A5","v":"M1"},{"$f":"SUMIF(H6:H13,\"x\",G6:G13)","v":0},{"$f":"IF(COUNTIF(H6:H13,\"x\")=0,MAX(G6:G13),0)","v":10},{"$f":"MAX(G6:G13)","v":10},{"$f":"IF(SUM(J7:J12)<>0,SUM(J7:J12),0)","v":0},{"$f":"IF(R5<0,O5,O5+R5)","v":0},{"$f":"IF(R5>0,O5,O5+R5)","v":0}]
["A","Configurazione morfologica associata a condizioni di energia estremamente bassa (rettilinei o sinuosi di pianura costiera, fondo sabbioso, privi di barre ",null,null,null,null,0,null,null,null,{"$f":"IF(COUNTIF(H6:H15,\"x\")>1,\"ERRORE SELEZIONE MULTIPLA!\",\"\")","v":""}]
[null,null,null,null,null,null,null,null,null,{"$f":"IF(OR(I7=\"\",H6=H8),\"\",IF(H6=\"x\",G8-G6,G6-G8))","v":""}]
["B","Configurazione associata a condizioni di bassa energia (sinuosi, meandriformi o anastomizzati privi di barre)",null,null,null,null,3]
[null,null,null,null,null,null,null,null,null,{"$f":"IF(OR(I9=\"\",H8=H10),\"\",IF(H8=\"x\",G10-G8,G8-G10))","v":""}]
["C","Configurazione morfologica associata a condizioni di medio-elevata energia (sinuosi o meandriformi con barre, sinuosi a barre alternate, letto piano e alvei a riffle-pool)\n",null,null,null,null,6]
[null,null,null,null,null,null,null,null,null,{"$f":"IF(OR(I11=\"\",H10=H12),\"\",IF(H10=\"x\",G12-G10,G10-G12))","v":""}]
["D","Configurazione morfologica associata a condizioni di elevata energia e mobilità laterale (wandering, a canali intrecciati)",null,null,null,null,10]
[]
[]
["NOTE:"]
[]
[]
["M2","Erodibilità delle sponde",null,null,null,null,"pt","scelta","conf","ptconf",null,null,null,{"$f":"A18","v":"M2"},{"$f":"SUMIF(H19:H28,\"x\",G19:G28)","v":0},{"$f":"IF(COUNTIF(H19:H28,\"x\")=0,MAX(G19:G28),0)","v":8},{"$f":"MAX(G19:G28)","v":8},{"$f":"IF(SUM(J20:J27)<>0,SUM(J20:J27),0)","v":0},{"$f":"IF(R18<0,O18,O18+R18)","v":0},{"$f":"IF(R18>0,O18,O18+R18)","v":0}]
["A","Presenza di sponde alluvionali erodibili (non protette) non coesive ≤10% o coesive ≤33% della lunghezza totale delle sponde (ovvero somma di entrambe) ",null,null,null,null,0,null,null,null,{"$f":"IF(COUNTIF(H19:H28,\"x\")>1,\"ERRORE SELEZIONE MULTIPLA!\",\"\")","v":""}]
[null,null,null,null,null,null,null,null,null,{"$f":"IF(OR(I20=\"\",H19=H21),\"\",IF(H19=\"x\",G21-G19,G19-G21))","v":""}]
["B","Presenza di sponde alluvionali erodibili (non protette) non coesive ≤33% o coesive ≤66% della lunghezza totale delle sponde (ovvero somma di entrambe) ",null,null,null,null,2]
[null,null,null,null,null,null,null,null,null,{"$f":"IF(OR(I22=\"\",H21=H23),\"\",IF(H21=\"x\",G23-G21,G21-G23))","v":""}]
["C","Presenza di sponde alluvionali erodibili (non protette) non coesive ≤66% o coesive ≤90% della lunghezza totale delle sponde (ovvero somma di entrambe) ",null,null,null,null,4]
[null,null,null,null,null,null,null,null,null,{"$f":"IF(OR(I24=\"\",H23=H25),\"\",IF(H23=\"x\",G25-G23,G23-G25))","v":""}]
["D","Presenza di sponde alluvionali erodibili (non protette) non coesive ≤90% o coesive >90% della lunghezza totale delle sponde (ovvero somma di entrambe) ",null,null,null,null,6]
[null,null,null,null,null,null,null,null,null,{"$f":"IF(OR(I26=\"\",H25=H27),\"\",IF(H25=\"x\",G27-G25,G25-G27))","v":""}]
["E","Presenza di sponde alluvionali erodibili (non protette) non coesive >90% della lunghezza totale delle sponde (ovvero somma di entrambe) ",null,null,null,null,8]
[]
["Nel caso di sponde prive di copertura vegetale >10% lunghezza totale: passare alla classe superiore"]
["Nel caso di sponde prive di copertura vegetale >33% lunghezza totale: passare a due classi superiori"]
["Nel caso di corsi d'acqua di bassa energia (di risorgiva o S≤0.001) e La>10 m: passare a due classi inferiori"]
["Nel caso di corsi d’acqua di bassa energia (di risorgiva o S ≤0.001) e La ≤ 10 m: si attribuisce alla classe A"]
[]
["NOTE:"]
[]
[]
["M3","Erodibilità del fondo",null,null,null,null,"pt","scelta","conf","ptconf",null,null,null,{"$f":"A37","v":"M3"},{"$f":"SUMIF(H38:H47,\"x\",G38:G47)","v":0},{"$f":"IF(COUNTIF(H38:H47,\"x\")=0,MAX(G38:G47),0)","v":8},{"$f":"MAX(G38:G47)","v":8},{"$f":"IF(SUM(J39:J46)<>0,SUM(J39:J46),0)","v":0},{"$f":"IF(R37<0,O37,O37+R37)","v":0},{"$f":"IF(R37>0,O37,O37+R37)","v":0}]
["A","Presenza di fondo alluvionale erodibile, non protetto da elementi artificiali (rivestimenti, rampe) e/o naturali (affioramenti, corazzamento) per ≤10% lunghezza tratto",null,null,null,null,0,null,null,null,{"$f":"IF(COUNTIF(H38:H47,\"x\")>1,\"ERRORE SELEZIONE MULTIPLA!\",\"\")","v":""}]
[null,null,null,null,null,null,null,null,null,{"$f":"IF(OR(I39=\"\",H38=H40),\"\",IF(H38=\"x\",G40-G38,G38-G40))","v":""}]
["B","Presenza di fondo alluvionale erodibile per 10÷33% lunghezza tratto",null,null,null,null,2]
[null,null,null,null,null,null,null,null,null,{"$f":"IF(OR(I41=\"\",H40=H42),\"\",IF(H40=\"x\",G42-G40,G40-G42))","v":""}]
["C","Presenza di fondo alluvionale erodibile per 33÷66% lunghezza tratto",null,null,null,null,4]
[null,null,null,null,null,null,null,null,null,{"$f":"IF(OR(I43=\"\",H42=H44),\"\",IF(H42=\"x\",G44-G42,G42-G44))","v":""}]
["D","Presenza di fondo alluvionale erodibile per 66÷90% lunghezza tratto",null,null,null,null,6]
[null,null,null,null,null,null,null,null,null,{"$f":"IF(OR(I45=\"\",H44=H46),\"\",IF(H44=\"x\",G46-G44,G44-G46))","v":""}]
["E","Presenza di fondo alluvionale erodibile per >90% lunghezza tratto",null,null,null,null,8]
[]
["Nel caso di corsi d'acqua di bassa energia (di risorgiva o S≤0.001) e La>10 m: passare a una classe inferiore"]
["Nel caso di corsi d'acqua di bassa energia (di risorgiva o S≤0.001) e La≤10 m: passare a due classi inferiori"]
[]
["NOTE:"]
[]
[]
["M4","Processi di arretramento delle sponde",null,null,null,null,"pt","scelta","conf","ptconf",null,null,null,{"$f":"A54","v":"M4"},{"$f":"SUMIF(H55:H64,\"x\",G55:G64)","v":0},{"$f":"IF(COUNTIF(H55:H64,\"x\")=0,MAX(G55:G64),0)","v":8},{"$f":"MAX(G55:G64)","v":8},{"$f":"IF(SUM(J56:J63)<>0,SUM(J56:J63),0)","v":0},{"$f":"IF(R54<0,O54,O54+R54)","v":0},{"$f":"IF(R54>0,O54,O54+R54)","v":0}]
["A","Completa assenza di sponde in arretramento",null,null,null,0,0,null,null,null,{"$f":"IF(COUNTIF(H55:H64,\"x\")>1,\"ERRORE SELEZIONE MULTIPLA!\",\"\")","v":""}]
[null,null,null,null,null,null,null,null,null,{"$f":"IF(OR(I56=\"\",H55=H57),\"\",IF(H55=\"x\",G57-G55,G55-G57))","v":""}]
["B","Sponde in arretramento ≤5% lunghezza totale (somma di entrambe) \noppure: sponde in arretramento ≤33% con tassi trascurabili",null,null,null,3,2]
[null,null,null,null,null,null,null,null,null,{"$f":"IF(OR(I58=\"\",H57=H59),\"\",IF(H57=\"x\",G59-G57,G57-G59))","v":""}]
["C","Sponde in arretramento ≤33% lunghezza totale (somma di entrambe) con tassi ≤3 m/a\noppure: sponde in arretramento >33% con tassi trascurabili",null,null,null,3,4]
[null,null,null,null,null,null,null,null,null,{"$f":"IF(OR(I60=\"\",H59=H61),\"\",IF(H59=\"x\",G61-G59,G59-G61))","v":""}]
["D","Sponde in arretramento ≤33% lunghezza totale (somma di entrambe) con tassi >3 m/a\noppure: sponde in arretramento >33% con tassi ≤3 m/a",null,null,null,3,6]
[null,null,null,null,null,null,null,null,null,{"$f":"IF(OR(I62=\"\",H61=H63),\"\",IF(H61=\"x\",G63-G61,G61-G63))","v":""}]
["E","Sponde in arretramento >33% lunghezza totale (somma di entrambe) con tassi >3 m/a",null,null,null,3,8]
[]
[]
["NOTE:"]
[]
[]
["M5","Tendenze di larghezza",null,null,null,null,"pt","scelta","conf","ptconf",null,null,null,{"$f":"A69","v":"M5"},{"$f":"SUMIF(H70:H79,\"x\",G70:G79)","v":0},{"$f":"IF(COUNTIF(H70:H79,\"x\")=0,MAX(G70:G79),0)","v":8},{"$f":"MAX(G70:G79)","v":8},{"$f":"IF(SUM(J71:J78)<>0,SUM(J71:J78),0)","v":0},{"$f":"IF(R69<0,O69,O69+R69)","v":0},{"$f":"IF(R69>0,O69,O69+R69)","v":0}]
["C-","Restringimento >25% (alvei a canale singolo o SBA) o >15% (alvei CI o W)",null,null,null,0,8,null,null,null,{"$f":"IF(COUNTIF(H70:H79,\"x\")>1,\"ERRORE SELEZIONE MULTIPLA!\",\"\")","v":""}]
[null,null,null,null,null,null,null,null,null,{"$f":"IF(OR(I71=\"\",H70=H72),\"\",IF(H70=\"x\",G72-G70,G70-G72))","v":""}]
["B-","Restringimento >10% (alvei a canale singolo o SBA) o >5% (alvei CI o W)",null,null,null,0,4]
[null,null,null,null,null,null,null,null,null,{"$f":"IF(OR(I73=\"\",H72=H74),\"\",IF(H72=\"x\",G74-G72,G72-G74))","v":""}]
["A","Variazioni di larghezza ≤10% (alvei a canale singolo o SBA) o ≤5% (alvei CI o W)",null,null,null,5,0]
[null,null,null,null,null,null,null,null,null,{"$f":"IF(OR(I75=\"\",H74=H76),\"\",IF(H74=\"x\",G76-G74,G74-G76))","v":""}]
["B+","Allargamento >10% (alvei a canale singolo o SBA) o >5% (alvei CI o W)",null,null,null,0,4]
[null,null,null,null,null,null,null,null,null,{"$f":"IF(OR(I77=\"\",H76=H78),\"\",IF(H76=\"x\",G78-G76,G76-G78))","v":""}]
["C+","Allargamento >25% (alvei a canale singolo o SBA) o >15% (alvei CI o W)",null,null,null,0,8]
[]
[]
["NOTE:"]
[]
[]
["M6","Tendenze altimetriche",null,null,null,null,"pt","scelta","conf","ptconf",null,null,null,{"$f":"A84","v":"M6"},{"$f":"SUMIF(H85:H94,\"x\",G85:G94)","v":0},{"$f":"IF(COUNTIF(H85:H94,\"x\")=0,MAX(G85:G94),0)","v":8},{"$f":"MAX(G85:G94)","v":8},{"$f":"IF(SUM(J86:J93)<>0,SUM(J86:J93),0)","v":0},{"$f":"IF(R84<0,O84,O84+R84)","v":0},{"$f":"IF(R84>0,O84,O84+R84)","v":0}]
["C-","Incisione: evidenze di incisione largamente prevalenti e diffuse",null,null,null,0,8,null,null,null,{"$f":"IF(COUNTIF(H85:H94,\"x\")>1,\"ERRORE SELEZIONE MULTIPLA!\",\"\")","v":""}]
[null,null,null,null,null,null,null,null,null,{"$f":"IF(OR(I86=\"\",H85=H87),\"\",IF(H85=\"x\",G87-G85,G85-G87))","v":""}]
["B-","Incisione lieve: evidenze di incisione prevalenti ma non diffuse",null,null,null,0,4]
[null,null,null,null,null,null,null,null,null,{"$f":"IF(OR(I88=\"\",H87=H89),\"\",IF(H87=\"x\",G89-G87,G87-G89))","v":""}]
["A","Equilibrio: assenza di prevalenti condizioni di incisione o sedimentazione",null,null,null,5,0]
[null,null,null,null,null,null,null,null,null,{"$f":"IF(OR(I90=\"\",H89=H91),\"\",IF(H89=\"x\",G91-G89,G89-G91))","v":""}]
["B+","Sedimentazione lieve: evidenze di sedimentazione prevalenti ma non diffuse",null,null,null,0,4]
[null,null,null,null,null,null,null,null,null,{"$f":"IF(OR(I92=\"\",H91=H93),\"\",IF(H91=\"x\",G93-G91,G91-G93))","v":""}]
["C+","Sedimentazione: evidenze di sedimentazione largamente prevalenti e diffuse",null,null,null,0,8]
[]
[]
["NOTE:"]
[]
[]
[]
[null,null,null,null,null,null,null,null,null,null,null,null,null,null,"SM tot","Sna(M)","Max(SMtot)","conf+","conf-"]
[null,null,null,null,null,null,null,null,null,null,null,null,null,"M",{"$f":"SUM(O5:O99)","v":0},{"$f":"SUM(P5:P99)","v":50},{"$f":"SUM(Q5:Q99)","v":50},{"$f":"SUMIF(R5:R99,\">0\",R5:R99)","v":0},{"$f":"SUMIF(R5:R99,\"<0\",R5:R99)","v":0}]
[]
[null,null,null,null,null,null,null,null,null,null,"NUM ERRORI"]
[null,null,null,null,null,null,null,null,null,null,{"$f":"COUNTIF(K6:M103,\"ERRORE*\")","v":0}]
[]
[]
["ESONDAZIONE INDOTTA"]
[]
["M5e","Tendenze di larghezza",null,null,null,null,"pt","scelta","conf","ptconf",null,null,null,{"$f":"A109","v":"M5e"},{"$f":"IF(COUNTIF(H110:H119,\"x\")=0, \"ND\",SUMIF(H110:H119,\"x\",G110:G119))","v":"ND"},{"$f":"IF(COUNTIF(H110:H119,\"x\")=0,MAX(G110:G119),0)","v":5},{"$f":"MAX(G110:G119)","v":5},{"$f":"IF(SUM(J111:J118)<>0,SUM(J111:J118),0)","v":0},{"$f":"IF(R109<0,O109,O109+R109)","v":{"$error":"#VALUE!"}},{"$f":"IF(R109>0,O109,O109+R109)","v":{"$error":"#VALUE!"}}]
["C-","Restringimento >25% (alvei a canale singolo o SBA) o >15% (alvei CI o W)",null,null,null,0,5,{"$f":"IF(H70=\"\",\"\",H70)","v":""},null,null,{"$f":"IF(COUNTIF(H110:H119,\"x\")>1,\"ERRORE SELEZIONE MULTIPLA!\",\"\")","v":""}]
[null,null,null,null,null,null,null,null,{"$f":"IF(I71=\"\",\"\",I71)","v":""},{"$f":"IF(OR(I111=\"\",H110=H112),\"\",IF(H110=\"x\",G112-G110,G110-G112))","v":""}]
["B-","Restringimento >10% (alvei a canale singolo o SBA) o >5% (alvei CI o W)",null,null,null,0,3,{"$f":"IF(H72=\"\",\"\",H72)","v":""}]
[null,null,null,null,null,null,null,null,{"$f":"IF(I73=\"\",\"\",I73)","v":""},{"$f":"IF(OR(I113=\"\",H112=H114),\"\",IF(H112=\"x\",G114-G112,G112-G114))","v":""}]
["A","Variazioni di larghezza ≤10% (alvei a canale singolo o SBA) o ≤5% (alvei CI o W)",null,null,null,5,0,{"$f":"IF(H74=\"\",\"\",H74)","v":""}]
[null,null,null,null,null,null,null,null,{"$f":"IF(I75=\"\",\"\",I75)","v":""},{"$f":"IF(OR(I115=\"\",H114=H116),\"\",IF(H114=\"x\",G116-G114,G114-G116))","v":""}]
["B+","Allargamento >10% (alvei a canale singolo o SBA) o >5% (alvei CI o W)",null,null,null,0,-3,{"$f":"IF(H76=\"\",\"\",H76)","v":""}]
[null,null,null,null,null,null,null,null,{"$f":"IF(I77=\"\",\"\",I77)","v":""},{"$f":"IF(OR(I117=\"\",H116=H118),\"\",IF(H116=\"x\",G118-G116,G116-G118))","v":""}]
["C+","Allargamento >25% (alvei a canale singolo o SBA) o >15% (alvei CI o W)",null,null,null,0,5,{"$f":"IF(H78=\"\",\"\",H78)","v":""}]
[]
[]
[{"$f":"A81","v":"NOTE:"}]
[]
[]
["M6e","Tendenze altimetriche",null,null,null,null,"pt","scelta","conf","ptconf",null,null,null,{"$f":"A124","v":"M6e"},{"$f":"IF(COUNTIF(H125:H134,\"x\")=0, \"ND\",SUMIF(H125:H134,\"x\",G125:G134))","v":"ND"},{"$f":"IF(COUNTIF(H125:H134,\"x\")=0,MAX(G125:G134),0)","v":5},{"$f":"MAX(G125:G134)","v":5},{"$f":"IF(SUM(J126:J133)<>0,SUM(J126:J133),0)","v":0},{"$f":"IF(R124<0,O124,O124+R124)","v":{"$error":"#VALUE!"}},{"$f":"IF(R124>0,O124,O124+R124)","v":{"$error":"#VALUE!"}}]
["C-","Incisione: evidenze di incisione largamente prevalenti e diffuse",null,null,null,0,-5,{"$f":"IF(H85=\"\",\"\",H85)","v":""},null,null,{"$f":"IF(COUNTIF(H125:H134,\"x\")>1,\"ERRORE SELEZIONE MULTIPLA!\",\"\")","v":""}]
[null,null,null,null,null,null,null,null,{"$f":"IF(I86=\"\",\"\",I86)","v":""},{"$f":"IF(OR(I126=\"\",H125=H127),\"\",IF(H125=\"x\",G127-G125,G125-G127))","v":""}]
["B-","Incisione lieve: evidenze di incisione prevalenti ma non diffuse",null,null,null,0,-3,{"$f":"IF(H87=\"\",\"\",H87)","v":""}]
[null,null,null,null,null,null,null,null,{"$f":"IF(I88=\"\",\"\",I88)","v":""},{"$f":"IF(OR(I128=\"\",H127=H129),\"\",IF(H127=\"x\",G129-G127,G127-G129))","v":""}]
["A","Equilibrio: assenza di prevalenti condizioni di incisione o sedimentazione",null,null,null,5,0,{"$f":"IF(H89=\"\",\"\",H89)","v":""}]
[null,null,null,null,null,null,null,null,{"$f":"IF(I90=\"\",\"\",I90)","v":""},{"$f":"IF(OR(I130=\"\",H129=H131),\"\",IF(H129=\"x\",G131-G129,G129-G131))","v":""}]
["B+","Sedimentazione lieve: evidenze di sedimentazione prevalenti ma non diffuse",null,null,null,0,3,{"$f":"IF(H91=\"\",\"\",H91)","v":""}]
[null,null,null,null,null,null,null,null,{"$f":"IF(I92=\"\",\"\",I92)","v":""},{"$f":"IF(OR(I132=\"\",H131=H133),\"\",IF(H131=\"x\",G133-G131,G131-G133))","v":""}]
["C+","Sedimentazione: evidenze di sedimentazione largamente prevalenti e diffuse",null,null,null,0,5,{"$f":"IF(H93=\"\",\"\",H93)","v":""}]
[]
[]
[{"$f":"A96","v":"NOTE:"}]

{"sheet":"ARTIFICIALITÀ","index":3,"n_rows":41,"n_cols":20,"rows_kept":41,"cut":false,"hidden":false,"merged":[[7,0,8,0],[7,6,8,6],[22,10,31,12],[6,9,7,9],[8,9,9,9],[25,9,26,9],[24,1,25,5],[24,6,25,6],[24,7,25,7],[5,1,6,5],[7,1,8,5],[9,1,10,5],[9,6,10,6],[9,7,10,7],[26,6,27,6],[26,7,27,7],[9,0,10,0],[0,0,1,9],[23,9,24,9],[13,1,14,5],[13,6,14,6],[13,7,14,7],[15,0,15,7],[21,1,21,5],[22,0,23,0],[13,0,14,0],[22,1,23,5],[22,6,23,6],[22,7,23,7],[4,1,4,5],[5,0,6,0],[5,6,6,6],[29,9,30,9],[25,8,26,8],[29,8,30,8],[28,1,29,5],[30,1,31,5],[30,6,31,6],[30,7,31,7],[27,9,28,9],[27,8,28,8],[28,6,29,6],[22,13,23,13],[24,13,25,13],[26,13,27,13],[11,13,12,13],[13,13,14,13],[5,10,14,12],[5,13,6,13],[7,13,8,13],[9,13,10,13],[7,7,8,7],[8,8,9,8],[10,8,11,8],[10,9,11,9],[12,8,13,8],[12,9,13,9],[5,7,6,7],[6,8,7,8],[33,0,33,7],[18,0,19,8],[35,0,36,8],[16,0,16,7],[11,0,12,0],[11,1,12,5],[11,6,12,6],[11,7,12,7],[32,0,32,7],[30,0,31,0],[28,0,29,0],[24,0,25,0],[28,7,29,7],[26,1,27,5],[26,0,27,0],[23,8,24,8]]}
["ARTIFICIALITÀ"]
[]
[]
[null,null,null,null,null,null,null,null,null,null,null,null,null,null,"SA tot","Sna(A)","Max(SAtot)","conf","Amax","Amin"]
["A1","Difese di sponda",null,null,null,null,"pt","scelta","conf","ptconf",null,null,null,{"$f":"A5","v":"A1"},{"$f":"SUMIF(H6:H15,\"x\",G6:G15)","v":0},{"$f":"IF(COUNTIF(H6:H15,\"x\")=0,MAX(G6:G15),0)","v":15},{"$f":"MAX(G6:G15)","v":15},{"$f":"IF(SUM(J7:J14)<>0,SUM(J7:J14),0)","v":0},{"$f":"IF(R5<0,O5,O5+R5)","v":0},{"$f":"IF(R5>0,O5,O5+R5)","v":0}]
["A","Difese di sponda per >80% lunghezza totale sponde (escluso versanti o terrazzi antichi)",null,null,null,null,0,null,null,null,{"$f":"IF(COUNTIF(H6:H15,\"x\")>1,\"ERRORE SELEZIONE MULTIPLA!\",\"\")","v":""}]
[null,null,null,null,null,null,null,null,null,{"$f":"IF(OR(I7=\"\",H6=H8),\"\",IF(H6=\"x\",G8-G6,G6-G8))","v":""}]
["B","Difese di sponda per 66÷80% lunghezza totale sponde (escluso versanti o terrazzi antichi)",null,null,null,null,4]
[null,null,null,null,null,null,null,null,null,{"$f":"IF(OR(I9=\"\",H8=H10),\"\",IF(H8=\"x\",G10-G8,G8-G10))","v":""}]
["C","Difese di sponda per 33÷66% lunghezza totale sponde (escluso versanti o terrazzi antichi)",null,null,null,null,8]
[null,null,null,null,null,null,null,null,null,{"$f":"IF(OR(I11=\"\",H10=H12),\"\",IF(H10=\"x\",G12-G10,G10-G12))","v":""}]
["D","Difese di sponda per 5÷33% lunghezza totale sponde (escluso versanti o terrazzi antichi)",null,null,null,null,12]
[null,null,null,null,null,null,null,null,null,{"$f":"IF(OR(I13=\"\",H12=H14),\"\",IF(H12=\"x\",G14-G12,G12-G14))","v":""}]
["E","Difese di sponda per ≤5% lunghezza totale sponde (escluso versanti o terrazzi antichi)",null,null,null,null,15]
[]
["Nel caso di corsi d'acqua di bassa energia (di risorgiva o S≤0.001) e La>10 m: passare a una classe inferiore"]
["Nel caso di corsi d'acqua di bassa energia (di risorgiva o S≤0.001) e La≤10 m: passare a due classi inferiori"]
[]
["NOTE:"]
[]
[]
["A2","Opere di rivestimento o consolidamento del fondo",null,null,null,null,"pt","scelta","conf","ptconf",null,null,null,{"$f":"A22","v":"A2"},{"$f":"SUMIF(H23:H32,\"x\",G23:G32)","v":0},{"$f":"IF(COUNTIF(H23:H32,\"x\")=0,MAX(G23:G32),0)","v":15},{"$f":"MAX(G23:G32)","v":15},{"$f":"IF(SUM(J24:J31)<>0,SUM(J24:J31),0)","v":0},{"$f":"IF(R22<0,O22,O22+R22)","v":0},{"$f":"IF(R22>0,O22,O22+R22)","v":0}]
["A","Rivestimenti del fondo per quasi tutto il tratto (>80% lunghezza)",null,null,null,null,0,null,null,null,{"$f":"IF(COUNTIF(H23:H32,\"x\")>1,\"ERRORE SELEZIONE MULTIPLA!\",\"\")","v":""}]
[null,null,null,null,null,null,null,null,null,{"$f":"IF(OR(I24=\"\",H23=H25),\"\",IF(H23=\"x\",G25-G23,G23-G25))","v":""}]
["B","Rivestimenti del fondo per 66÷80% della lunghezza del tratto\noppure come D con presenza di diga all’estremità a valle",null,null,null,null,4]
[null,null,null,null,null,null,null,null,null,{"$f":"IF(OR(I26=\"\",H25=H27),\"\",IF(H25=\"x\",G27-G25,G25-G27))","v":""}]
["C","Rivestimenti del fondo per 33÷66% della lunghezza del tratto e/o soglie, rampe, briglie, traverse >1 ogni d, dove d=1000 m per S≤ 1%; d=200 m per S>1%\noppure come E con presenza di diga all’estremità a valle\n",null,null,null,null,8]
[null,null,null,null,null,null,null,null,null,{"$f":"IF(OR(I28=\"\",H27=H29),\"\",IF(H27=\"x\",G29-G27,G27-G29))","v":""}]
["D","Rivestimenti del fondo per 5÷33% della lunghezza del tratto e/osoglie, rampe, briglie, traverse ≤1 ogni d, dove d=1000 m per S≤ 1%; d=200 m per S>1%",null,null,null,null,12]
[null,null,null,null,null,null,null,null,null,{"$f":"IF(OR(I30=\"\",H29=H31),\"\",IF(H29=\"x\",G31-G29,G29-G31))","v":""}]
["E","Assenza o presenza localizzata di rivestimenti (≤5% lunghezza del tratto) e assenza di altre opere di consolidamento (soglie, rampe)",null,null,null,null,15]
[]
["Nel caso di corsi d'acqua di bassa energia (di risorgiva o S≤0.001) e La>10 m: passare a una classe inferiore"]
["Nel caso di corsi d'acqua di bassa energia (di risorgiva o S≤0.001) e La≤10 m: passare a due classi inferiori"]
[]
["NOTE:"]
[]
[]
[null,null,null,null,null,null,null,null,null,null,null,null,null,null,"SA tot","Sna(A)","Max(SAtot)","conf+","conf-"]
[null,null,null,null,null,null,null,null,null,null,"NUM ERRORI",null,null,"A",{"$f":"SUM(O5:O38)","v":0},{"$f":"SUM(P5:P38)","v":30},{"$f":"SUM(Q5:Q38)","v":30},{"$f":"SUMIF(R5:R38,\">0\",R5:R38)","v":0},{"$f":"SUMIF(R5:R38,\"<0\",R5:R38)","v":0}]
[null,null,null,null,null,null,null,null,null,null,{"$f":"COUNTIF(K6:M38,\"ERRORE SELEZIONE MULTIPLA!\")","v":0}]

{"sheet":"VARIAZIONI MORFOLOGICHE","index":4,"n_rows":87,"n_cols":20,"rows_kept":87,"cut":false,"hidden":false,"merged":[[83,6,84,6],[83,7,84,7],[85,0,85,7],[53,0,53,9],[80,8,81,8],[80,9,81,9],[81,0,82,0],[81,1,82,5],[81,6,82,6],[81,7,82,7],[82,8,83,8],[82,9,83,9],[83,0,84,0],[83,1,84,5],[77,0,78,0],[77,1,78,5],[77,6,78,6],[77,7,78,7],[78,8,79,8],[78,9,79,9],[79,0,80,0],[79,1,80,5],[79,6,80,6],[79,7,80,7],[71,10,74,12],[72,8,73,8],[72,9,73,9],[73,0,74,0],[73,1,74,5],[73,6,74,6],[73,7,74,7],[74,8,75,8],[74,9,75,9],[75,0,76,0],[75,1,76,5],[75,6,76,6],[75,7,76,7],[76,8,77,8],[76,9,77,9],[63,9,64,9],[64,0,65,0],[64,1,65,5],[64,6,65,6],[64,7,65,7],[70,1,70,5],[71,0,72,0],[71,1,72,5],[71,6,72,6],[71,7,72,7],[56,0,57,0],[56,1,57,5],[56,6,57,6],[56,7,57,7],[56,10,59,12],[57,8,58,8],[57,9,58,9],[58,0,59,0],[58,1,59,5],[58,6,59,6],[58,7,59,7],[59,8,60,8],[59,9,60,9],[60,0,61,0],[60,1,61,5],[60,6,61,6],[60,7,61,7],[61,8,62,8],[61,9,62,9],[62,0,63,0],[62,1,63,5],[62,6,63,6],[62,7,63,7],[63,8,64,8],[0,0,1,9],[35,6,36,6],[35,7,36,7],[31,1,32,5],[31,6,32,6],[55,1,55,5],[31,0,32,0],[35,1,36,5],[5,7,6,7],[18,1,19,5],[4,1,4,5],[5,0,6,0],[5,1,6,5],[5,6,6,6],[18,0,19,0],[9,6,10,6],[12,0,13,8],[7,0,8,0],[7,1,8,5],[7,6,8,6],[9,0,10,0],[9,1,10,5],[18,6,19,6],[17,8,18,8],[17,9,18,9],[9,7,10,7],[30,1,30,5],[31,7,32,7],[6,8,7,8],[18,7,19,7],[6,9,7,9],[7,7,8,7],[33,0,34,0],[33,1,34,5],[33,6,34,6],[33,7,34,7],[34,8,35,8],[34,9,35,9],[35,0,36,0],[8,9,9,9],[20,0,21,0],[20,1,21,5],[20,6,21,6],[20,7,21,7],[19,8,20,8],[19,9,20,9],[21,8,22,8],[22,0,23,0],[15,1,15,5],[22,7,23,7],[24,0,25,0],[24,1,25,5],[24,6,25,6],[24,7,25,7],[8,8,9,8],[16,0,17,0],[16,1,17,5],[16,6,17,6],[16,7,17,7],[32,8,33,8],[32,9,33,9],[27,0,28,8],[22,1,23,5],[22,6,23,6],[37,0,38,0],[37,1,38,5],[37,6,38,6],[37,7,38,7],[38,8,39,8],[38,9,39,9],[39,0,40,0],[39,1,40,5],[39,6,40,6],[39,7,40,7],[46,0,47,8],[5,10,10,12],[16,10,25,12],[31,10,44,12],[67,0,68,8],[86,0,87,8],[45,0,45,7],[40,8,41,8],[40,9,41,9],[42,8,43,8],[42,9,43,9],[41,0,42,0],[41,1,42,5],[41,6,42,6],[41,7,42,7],[43,0,44,0],[43,1,44,5],[43,6,44,6],[43,7,44,7],[21,9,22,9],[23,8,24,8],[23,9,24,9],[36,8,37,8],[36,9,37,9]]}
["VARIAZIONI MORFOLOGICHE"]
[]
[]
[null,null,null,null,null,null,null,null,null,null,null,null,null,null,"SV tot","Sna(V)","Max(SVtot)","conf","Vmax","Vmin"]
["V1","Variazioni della configurazione morfologica",null,null,null,null,"pt","scelta","conf","ptconf",null,null,null,{"$f":"A5","v":"V1"},{"$f":"SUMIF(H6:H11,\"x\",G6:G11)","v":0},{"$f":"IF(COUNTIF(H6:H11,\"x\")=0,MAX(G6:G11),0)","v":5},{"$f":"MAX(G6:G11)","v":5},{"$f":"IF(SUM(J7:J10)<>0,SUM(J7:J10),0)","v":0},{"$f":"IF(R5<0,O5,O5+R5)","v":0},{"$f":"IF(R5>0,O5,O5+R5)","v":0}]
["A","Assenza di variazioni di configurazione morfologica rispetto ad anni '50",null,null,null,null,0,null,null,null,{"$f":"IF(COUNTIF(H6:H11,\"x\")>1,\"ERRORE SELEZIONE MULTIPLA!\",\"\")","v":""}]
[null,null,null,null,null,null,null,null,null,{"$f":"IF(OR(I7=\"\",H6=H8),\"\",IF(H6=\"x\",G8-G6,G6-G8))","v":""}]
["B","Variazioni di configurazione morfologica tra tipologie contigue rispetto ad anni '50",null,null,null,null,3]
[null,null,null,null,null,null,null,null,null,{"$f":"IF(OR(I9=\"\",H8=H10),\"\",IF(H8=\"x\",G10-G8,G8-G10))","v":""}]
["C","Variazioni di configurazione morfologica tra tipologie non contigue rispetto ad anni '50",null,null,null,null,5]
[]
[]
["NOTE:"]
[]
[]
["V2","Variazioni di larghezza",null,null,null,null,"pt","scelta","conf","ptconf",null,null,null,{"$f":"A16","v":"V2"},{"$f":"SUMIF(H17:H26,\"x\",G17:G26)","v":0},{"$f":"IF(COUNTIF(H17:H26,\"x\")=0,MAX(G17:G26),0)","v":5},{"$f":"MAX(G17:G26)","v":5},{"$f":"IF(SUM(J18:J25)<>0,SUM(J18:J25),0)","v":0},{"$f":"IF(R16<0,O16,O16+R16)","v":0},{"$f":"IF(R16>0,O16,O16+R16)","v":0}]
["C-","Restringimento intenso (>35%) rispetto ad anni '50",null,null,null,null,5,null,null,null,{"$f":"IF(COUNTIF(H17:H26,\"x\")>1,\"ERRORE SELEZIONE MULTIPLA!\",\"\")","v":""}]
[null,null,null,null,null,null,null,null,null,{"$f":"IF(OR(I18=\"\",H17=H19),\"\",IF(H17=\"x\",G19-G17,G17-G19))","v":""}]
["B-","Restringimento moderato (15÷35%) rispetto ad anni '50",null,null,null,null,3]
[null,null,null,null,null,null,null,null,null,{"$f":"IF(OR(I20=\"\",H19=H21),\"\",IF(H19=\"x\",G21-G19,G19-G21))","v":""}]
["A","Variazioni di larghezza nulle o limitate (≤15%) rispetto ad anni '50",null,null,null,null,0]
[null,null,null,null,null,null,null,null,null,{"$f":"IF(OR(I22=\"\",H21=H23),\"\",IF(H21=\"x\",G23-G21,G21-G23))","v":""}]
["B+","Allargamento moderato (15÷35%) rispetto ad anni '50",null,null,null,null,3]
[null,null,null,null,null,null,null,null,null,{"$f":"IF(OR(I24=\"\",H23=H25),\"\",IF(H23=\"x\",G25-G23,G23-G25))","v":""}]
["C+","Allargamento intenso (>35%) rispetto ad anni '50",null,null,null,null,5]
[]
[]
["NOTE:"]
[]
[]
["V3","Variazioni altimetriche",null,null,null,null,"pt","scelta","conf","ptconf",null,null,null,{"$f":"A31","v":"V3"},{"$f":"SUMIF(H32:H45,\"x\",G32:G45)","v":0},{"$f":"IF(COUNTIF(H32:H45,\"x\")=0,MAX(G32:G45),0)","v":10},{"$f":"MAX(G32:G45)","v":10},{"$f":"IF(SUM(J33:J44)<>0,SUM(J33:J44),0)","v":0},{"$f":"IF(R31<0,O31,O31+R31)","v":0},{"$f":"IF(R31>0,O31,O31+R31)","v":0}]
["D-","Incisione molto intensa (>6 m)",null,null,null,null,10,null,null,null,{"$f":"IF(COUNTIF(H32:H45,\"x\")>1,\"ERRORE SELEZIONE MULTIPLA!\",\"\")","v":""}]
[null,null,null,null,null,null,null,null,null,{"$f":"IF(OR(I33=\"\",H32=H34),\"\",IF(H32=\"x\",G34-G32,G32-G34))","v":""}]
["C-","Incisione intensa (3÷6 m)",null,null,null,null,6]
[null,null,null,null,null,null,null,null,null,{"$f":"IF(OR(I35=\"\",H34=H36),\"\",IF(H34=\"x\",G36-G34,G34-G36))","v":""}]
["B-","Incisione limitata o moderata (0.5÷3 m)",null,null,null,null,3]
[null,null,null,null,null,null,null,null,null,{"$f":"IF(OR(I37=\"\",H36=H38),\"\",IF(H36=\"x\",G38-G36,G36-G38))","v":""}]
["A","Variazioni della quota del fondo trascurabili (≤0.5 m)",null,null,null,null,0]
[null,null,null,null,null,null,null,null,null,{"$f":"IF(OR(I39=\"\",H38=H40),\"\",IF(H38=\"x\",G40-G38,G38-G40))","v":""}]
["B+","Sedimentazione limitata o moderata (0.5÷3 m)",null,null,null,null,3]
[null,null,null,null,null,null,null,null,null,{"$f":"IF(OR(I41=\"\",H40=H42),\"\",IF(H40=\"x\",G42-G40,G40-G42))","v":""}]
["C+","Sedimentazione intensa (3÷6 m)",null,null,null,null,6]
[null,null,null,null,null,null,null,null,null,{"$f":"IF(OR(I43=\"\",H42=H44),\"\",IF(H42=\"x\",G44-G42,G42-G44))","v":""}]
["D+","Sedimentazione molto intensa (>6 m)",null,null,null,null,10]
[]
["Non si valuta nel caso di assoluta manacanza di dati, informazioni ed evidenze sul terreno"]
["NOTE:"]
[]
[null,null,null,null,null,null,null,null,null,null,null,null,null,null,"SV tot","Sna(V)","Max(SVtot)","conf+","conf-"]
[null,null,null,null,null,null,null,null,null,null,"NUM ERRORI",null,null,"V",{"$f":"SUM(O5:O48)","v":0},{"$f":"SUM(P5:P48)","v":20},{"$f":"SUM(Q5:Q48)","v":20},{"$f":"SUMIF(R5:R48,\">0\",R5:R48)","v":0},{"$f":"SUMIF(R5:R48,\"<0\",R5:R48)","v":0}]
[null,null,null,null,null,null,null,null,null,null,{"$f":"COUNTIF(K6:M30,\"ERRORE SELEZIONE MULTIPLA!\")","v":0}]
[]
[]
["ESONDAZIONE INDOTTA"]
[]
["V2e","Variazioni di larghezza",null,null,null,null,"pt","scelta","conf","ptconf",null,null,null,{"$f":"A56","v":"V2e"},{"$f":"IF(COUNTIF(H57:H66,\"x\")=0,\"ND\",SUMIF(H57:H66,\"x\",G57:G66))","v":"ND"},{"$f":"IF(COUNTIF(H57:H66,\"x\")=0,MAX(G57:G66),0)","v":3},{"$f":"MAX(G57:G66)","v":3},{"$f":"IF(SUM(J58:J65)<>0,SUM(J58:J65),0)","v":0},{"$f":"IF(R56<0,O56,O56+R56)","v":{"$error":"#VALUE!"}},{"$f":"IF(R56>0,O56,O56+R56)","v":{"$error":"#VALUE!"}}]
["C-","Restringimento intenso (>35%) rispetto ad anni '50",null,null,null,null,3,{"$f":"IF(H17=\"\",\"\",H17)","v":""},null,null,{"$f":"IF(COUNTIF(H57:H60,\"x\")>1,\"ERRORE SELEZIONE MULTIPLA!\",\"\")","v":""}]
[null,null,null,null,null,null,null,null,{"$f":"IF(I18=\"\",\"\",I18)","v":""},{"$f":"IF(OR(I58=\"\",H57=H59),\"\",IF(H57=\"x\",G59-G57,G57-G59))","v":""}]
["B-","Restringimento moderato (15÷35%) rispetto ad anni '50",null,null,null,null,2,{"$f":"IF(H19=\"\",\"\",H19)","v":""}]
[null,null,null,null,null,null,null,null,{"$f":"IF(I20=\"\",\"\",I20)","v":""},{"$f":"IF(OR(I60=\"\",H59=H61),\"\",IF(H59=\"x\",G61-G59,G59-G61))","v":""}]
["A","Variazioni di larghezza nulle o limitate (≤15%) rispetto ad anni '50",null,null,null,null,0,{"$f":"IF(H21=\"\",\"\",H21)","v":""}]
[null,null,null,null,null,null,null,null,{"$f":"IF(I22=\"\",\"\",I22)","v":""},{"$f":"IF(OR(I62=\"\",H61=H63),\"\",IF(H61=\"x\",G63-G61,G61-G63))","v":""}]
["B+","Allargamento moderato (15÷35%) rispetto ad anni '50",null,null,null,null,-2,{"$f":"IF(H23=\"\",\"\",H23)","v":""}]
[null,null,null,null,null,null,null,null,{"$f":"IF(I24=\"\",\"\",I24)","v":""},{"$f":"IF(OR(I64=\"\",H63=H65),\"\",IF(H63=\"x\",G65-G63,G63-G65))","v":""}]
["C+","Allargamento intenso (>35%) rispetto ad anni '50",null,null,null,null,-3,{"$f":"IF(H25=\"\",\"\",H25)","v":""}]
[]
[]
[{"$f":"A28","v":"NOTE:"}]
[]
[]
["V3e","Variazioni altimetriche",null,null,null,null,"pt","scelta","conf","ptconf",null,null,null,{"$f":"A71","v":"V3e"},{"$f":"IF(COUNTIF(H72:H85,\"x\")=0,\"ND\",SUMIF(H72:H85,\"x\",G72:G85))","v":"ND"},{"$f":"IF(COUNTIF(H72:H85,\"x\")=0,MAX(G72:G85),0)","v":3},{"$f":"MAX(G72:G85)","v":3},{"$f":"IF(SUM(J73:J84)<>0,SUM(J73:J84),0)","v":0},{"$f":"IF(R71<0,O71,O71+R71)","v":{"$error":"#VALUE!"}},{"$f":"IF(R71>0,O71,O71+R71)","v":{"$error":"#VALUE!"}}]
["D-","Incisione molto intensa (>6 m)",null,null,null,null,-3,{"$f":"IF(H32=\"\",\"\",H32)","v":""},null,null,{"$f":"IF(COUNTIF(H72:H75,\"x\")>1,\"ERRORE SELEZIONE MULTIPLA!\",\"\")","v":""}]
[null,null,null,null,null,null,null,null,{"$f":"IF(I33=\"\",\"\",I33)","v":""},{"$f":"IF(OR(I73=\"\",H72=H74),\"\",IF(H72=\"x\",G74-G72,G72-G74))","v":""}]
["C-","Incisione intensa (3÷6 m)",null,null,null,null,-2,{"$f":"IF(H34=\"\",\"\",H34)","v":""}]
[null,null,null,null,null,null,null,null,{"$f":"IF(I35=\"\",\"\",I35)","v":""},{"$f":"IF(OR(I75=\"\",H74=H76),\"\",IF(H74=\"x\",G76-G74,G74-G76))","v":""}]
["B-","Incisione limitata o moderata (0.5÷3 m)",null,null,null,null,-1,{"$f":"IF(H36=\"\",\"\",H36)","v":""}]
[null,null,null,null,null,null,null,null,{"$f":"IF(I37=\"\",\"\",I37)","v":""},{"$f":"IF(OR(I77=\"\",H76=H78),\"\",IF(H76=\"x\",G78-G76,G76-G78))","v":""}]
["A","Variazioni della quota del fondo trascurabili (≤0.5 m)",null,null,null,null,0,{"$f":"IF(H38=\"\",\"\",H38)","v":""}]
[null,null,null,null,null,null,null,null,{"$f":"IF(I39=\"\",\"\",I39)","v":""},{"$f":"IF(OR(I79=\"\",H78=H80),\"\",IF(H78=\"x\",G80-G78,G78-G80))","v":""}]
["B+","Sedimentazione limitata o moderata (0.5÷3 m)",null,null,null,null,1,{"$f":"IF(H40=\"\",\"\",H40)","v":""}]
[null,null,null,null,null,null,null,null,{"$f":"IF(I41=\"\",\"\",I41)","v":""},{"$f":"IF(OR(I81=\"\",H80=H82),\"\",IF(H80=\"x\",G82-G80,G80-G82))","v":""}]
["C+","Sedimentazione intensa (3÷6 m)",null,null,null,null,2,{"$f":"IF(H42=\"\",\"\",H42)","v":""}]
[null,null,null,null,null,null,null,null,{"$f":"IF(I43=\"\",\"\",I43)","v":""},{"$f":"IF(OR(I83=\"\",H82=H84),\"\",IF(H82=\"x\",G84-G82,G82-G84))","v":""}]
["D+","Sedimentazione molto intensa (>6 m)",null,null,null,null,3,{"$f":"IF(H44=\"\",\"\",H44)","v":""}]
[]
["Non si valuta nel caso di assoluta manacanza di dati, informazioni ed evidenze sul terreno"]
[{"$f":"A47","v":"NOTE:"}]

{"sheet":"CALC_INDICI","index":5,"n_rows":32,"n_cols":11,"rows_kept":32,"cut":false,"hidden":false,"merged":[]}
["SUB-INDICI"]
[]
["Sub-indice di Morfologia e Processi",null,"Sub-indice di Artificialità",null,"Sub-indice di Variazioni"]
[null,null,null,null,null,null,"S"]
["SMtot = M1+…+M6",{"$f":"MORFOLOGIAePROCESSI!O101","v":0},"SAtot = A1+A2",{"$f":"ARTIFICIALITÀ!O40","v":0},"SVtot = V1+V2+V3",{"$f":"'VARIAZIONI MORFOLOGICHE'!O50","v":0},{"$f":"SUM(B5,D5,F5)","v":0}]
["[SMtot ]conf-",{"$f":"(B5+MORFOLOGIAePROCESSI!S101)","v":0},"[SAtot]conf-",{"$f":"(D5+ARTIFICIALITÀ!S40)","v":0},"[SVtot]conf-",{"$f":"(F5+'VARIAZIONI MORFOLOGICHE'!S50)","v":0},{"$f":"SUM(B6,D6,F6)","v":0}]
["[SMtot]conf+",{"$f":"(B5+ MORFOLOGIAePROCESSI!R101)","v":0},"[SAtot]conf+",{"$f":"(D5+ ARTIFICIALITÀ!R40)","v":0},"[SVtot]conf+",{"$f":" (F5+'VARIAZIONI MORFOLOGICHE'!R50)","v":0},0]
["Max(SM tot) = Max(M1)+…+ Max(M6)",{"$f":"MORFOLOGIAePROCESSI!Q101","v":50},"Max(SA tot) = Max(A1)+Max(A2)",{"$f":"ARTIFICIALITÀ!Q40","v":30},"Max(SV tot) = Max(V1)+…+ Max(V3)",{"$f":"'VARIAZIONI MORFOLOGICHE'!Q50","v":20},100]
["Sna(M) = S [Max(Mi)non applicati]",{"$f":"MORFOLOGIAePROCESSI!P101","v":50},"Sna(A) = S [Max(Ai)non applicati]",{"$f":"ARTIFICIALITÀ!P40","v":30},"Sna(V) = S [Max(Vi)non applicati]",{"$f":"'VARIAZIONI MORFOLOGICHE'!P50","v":20},100]
["SMmax=Max(SMtot)-Sna(M)",{"$f":"B8-B9","v":0},"SAmax=Max(SAtot)-Sna(A)",{"$f":"D8-D9","v":0},"SVmax=Max(SVtot)-Sna(V)",{"$f":"F8-F9","v":0},0]
[]
["IDMM = SMtot/Smax",{"$f":"B5/C23","v":{"$error":"#DIV/0!"}},"IDMA = SAtot/Smax",{"$f":"D5/C23","v":{"$error":"#DIV/0!"}},"IDMV = SVtot/Smax",{"$f":"F5/C23","v":{"$error":"#DIV/0!"}},{"$error":"#DIV/0!"}]
["[IDMM]conf-",{"$f":"B6/$C$23","v":{"$error":"#DIV/0!"}},"[IDMA]conf-",{"$f":"D6/$C$23","v":{"$error":"#DIV/0!"}},"[IDMV]conf-",{"$f":"F6/$C$23","v":{"$error":"#DIV/0!"}},{"$error":"#DIV/0!"}]
["[IDMM]conf+",{"$f":"B7/$C$23","v":{"$error":"#DIV/0!"}},"[IDMA]conf+",{"$f":"D7/$C$23","v":{"$error":"#DIV/0!"}},"[IDMV]conf+",{"$f":"F7/$C$23","v":{"$error":"#DIV/0!"}},{"$error":"#DIV/0!"}]
[]
[]
[]
["Stot = SFtot+SAtot+SVtot ",null,{"$f":"B5+D5+F5","v":0},null,"IDM = Stot/Smax",{"$f":"ROUND(C18/$C$23,2)","v":{"$error":"#DIV/0!"}}]
["[Stot]conf-",null,{"$f":"B6+D6+F6","v":0},null,"IDMmin= [Stot]conf-/Smax",{"$f":"C19/$C$23","v":{"$error":"#DIV/0!"}}]
["[Stot]conf+",null,{"$f":"B7+D7+F7","v":0},null,"IDMmax= [Stot]conf+/Smax",{"$f":"C20/$C$23","v":{"$error":"#DIV/0!"}}]
["Max(Stot)=Max(SMtot)+Max(SAtot)+Max(SVtot)",null,{"$f":"B8+D8+F8","v":100}]
["Sna=(Sna(M)+Sna(A)+Sna(V))",null,{"$f":"B9+D9+F9","v":100}]
["Smax = (Max(SMtot)+Max(SAtot)+Max(SVtot)) - (Sna(M)+Sna(A)+Sna(V))",null,{"$f":"C21-C22","v":0}]
[]
[]
[]
["Sub-indice di Dinamica Laterale",null,null,null,"Sub-indice di Dinamica Verticale",null,null,null,"Sub-indice di Esondazione Indotta"]
[null,null,null,null,null,null,null,null,{"$f":"IF(OR(VLOOKUP(\"M5e\",MORFOLOGIAePROCESSI!N109:T124,2,FALSE)=\"ND\",VLOOKUP(\"M6e\",MORFOLOGIAePROCESSI!N109:T124,2,FALSE)=\"ND\",VLOOKUP(\"V2e\",'VARIAZIONI MORFOLOGICHE'!N56:T71,2,FALSE)=\"ND\",VLOOKUP(\"V3e\",'VARIAZIONI MORFOLOGICHE'!N56:T71,2,FALSE)=\"ND\"),\"Impossibile calcolare il SUB-INDICE se M5, M6, V2 o V3 non sono compilati!\",\"\")","v":"Impossibile calcolare il SUB-INDICE se M5, M6, V2 o V3 non sono compilati!"}]
["SDL = (M1+M2+M4+M5+A1+V1+V2)/Smax",null,{"$f":"(VLOOKUP(\"M1\",MORFOLOGIAePROCESSI!N5:T84,2,FALSE)+VLOOKUP(\"M2\",MORFOLOGIAePROCESSI!N5:T84,2,FALSE)+VLOOKUP(\"M4\",MORFOLOGIAePROCESSI!N5:T84,2,FALSE)+VLOOKUP(\"M5\",MORFOLOGIAePROCESSI!N5:T84,2,FALSE)+VLOOKUP(\"A1\",ARTIFICIALITÀ!N5:T22,2,FALSE)+VLOOKUP(\"V1\",'VARIAZIONI MORFOLOGICHE'!N5:T31,2,FALSE)+VLOOKUP(\"V2\",'VARIAZIONI MORFOLOGICHE'!N5:T31,2,FALSE))/C23","v":{"$error":"#DIV/0!"}},null,"SDV = (M3+M6+A2+V3)/Smax",null,{"$f":"(VLOOKUP(\"M3\",MORFOLOGIAePROCESSI!N5:T84,2,FALSE)+VLOOKUP(\"M6\",MORFOLOGIAePROCESSI!N5:T84,2,FALSE)+VLOOKUP(\"A2\",ARTIFICIALITÀ!N5:T22,2,FALSE)+VLOOKUP(\"V3\",'VARIAZIONI MORFOLOGICHE'!N5:T31,2,FALSE))/C23","v":{"$error":"#DIV/0!"}},null,"SEI = (M5e+M6e+V2e+V3e)/Smaxe",null,{"$f":"(VLOOKUP(\"M5e\",MORFOLOGIAePROCESSI!N109:T124,2,FALSE)+VLOOKUP(\"M6e\",MORFOLOGIAePROCESSI!N109:T124,2,FALSE)+VLOOKUP(\"V2e\",'VARIAZIONI MORFOLOGICHE'!N56:T71,2,FALSE)+VLOOKUP(\"V3e\",'VARIAZIONI MORFOLOGICHE'!N56:T71,2,FALSE))/K30","v":{"$error":"#VALUE!"}}]
["[SDL]conf-",null,{"$f":"(VLOOKUP(\"M1\",MORFOLOGIAePROCESSI!N5:T84,7,FALSE)+VLOOKUP(\"M2\",MORFOLOGIAePROCESSI!N5:T84,7,FALSE)+VLOOKUP(\"M4\",MORFOLOGIAePROCESSI!N5:T84,7,FALSE)+VLOOKUP(\"M5\",MORFOLOGIAePROCESSI!N5:T84,7,FALSE)+VLOOKUP(\"A1\",ARTIFICIALITÀ!N5:T22,7,FALSE)+VLOOKUP(\"V1\",'VARIAZIONI MORFOLOGICHE'!N5:T31,7,FALSE)+VLOOKUP(\"V2\",'VARIAZIONI MORFOLOGICHE'!N5:T31,7,FALSE))/C23","v":{"$error":"#DIV/0!"}},null,"[SDV]conf-",null,{"$f":"(VLOOKUP(\"M3\",MORFOLOGIAePROCESSI!N5:T84,7,FALSE)+VLOOKUP(\"M6\",MORFOLOGIAePROCESSI!N5:T84,7,FALSE)+VLOOKUP(\"A2\",ARTIFICIALITÀ!N5:T22,7,FALSE)+VLOOKUP(\"V3\",'VARIAZIONI MORFOLOGICHE'!N5:T31,7,FALSE))/C23","v":{"$error":"#DIV/0!"}},null,"Smaxe = Max(M5e)+Max(M6e)+ Max(V2e)+Max(V3e)",null,{"$f":"(VLOOKUP(\"M5e\",MORFOLOGIAePROCESSI!N109:T124,4,FALSE)+VLOOKUP(\"M6e\",MORFOLOGIAePROCESSI!N109:T124,4,FALSE)+VLOOKUP(\"V2e\",'VARIAZIONI MORFOLOGICHE'!N56:T71,4,FALSE)+VLOOKUP(\"V3e\",'VARIAZIONI MORFOLOGICHE'!N56:T71,4,FALSE))","v":16}]
["[SDL]conf+",null,{"$f":"(VLOOKUP(\"M1\",MORFOLOGIAePROCESSI!N5:T84,6,FALSE)+VLOOKUP(\"M2\",MORFOLOGIAePROCESSI!N5:T84,6,FALSE)+VLOOKUP(\"M4\",MORFOLOGIAePROCESSI!N5:T84,6,FALSE)+VLOOKUP(\"M5\",MORFOLOGIAePROCESSI!N5:T84,6,FALSE)+VLOOKUP(\"A1\",ARTIFICIALITÀ!N5:T22,6,FALSE)+VLOOKUP(\"V1\",'VARIAZIONI MORFOLOGICHE'!N5:T31,6,FALSE)+VLOOKUP(\"V2\",'VARIAZIONI MORFOLOGICHE'!N5:T31,6,FALSE))/C23","v":{"$error":"#DIV/0!"}},null,"[SDV]conf+",null,{"$f":"(VLOOKUP(\"M3\",MORFOLOGIAePROCESSI!N5:T84,6,FALSE)+VLOOKUP(\"M6\",MORFOLOGIAePROCESSI!N5:T84,6,FALSE)+VLOOKUP(\"A2\",ARTIFICIALITÀ!N5:T22,6,FALSE)+VLOOKUP(\"V3\",'VARIAZIONI MORFOLOGICHE'!N5:T31,6,FALSE))/C23","v":{"$error":"#DIV/0!"}},null,"[SEI]conf-",null,{"$f":"(VLOOKUP(\"M5e\",MORFOLOGIAePROCESSI!N109:T124,7,FALSE)+VLOOKUP(\"M6e\",MORFOLOGIAePROCESSI!N109:T124,7,FALSE)+VLOOKUP(\"V2e\",'VARIAZIONI MORFOLOGICHE'!N56:T71,7,FALSE)+VLOOKUP(\"V3e\",'VARIAZIONI MORFOLOGICHE'!N56:T71,7,FALSE))/K30","v":{"$error":"#VALUE!"}}]
[null,null,null,null,null,null,null,null,"[SEI]conf+",null,{"$f":"(VLOOKUP(\"M5e\",MORFOLOGIAePROCESSI!N109:T124,6,FALSE)+VLOOKUP(\"M6e\",MORFOLOGIAePROCESSI!N109:T124,6,FALSE)+VLOOKUP(\"V2e\",'VARIAZIONI MORFOLOGICHE'!N56:T71,6,FALSE)+VLOOKUP(\"V3e\",'VARIAZIONI MORFOLOGICHE'!N56:T71,6,FALSE))/K30","v":{"$error":"#VALUE!"}}]

{"sheet":"SINTESI","index":6,"n_rows":35,"n_cols":12,"rows_kept":35,"cut":false,"hidden":false,"merged":[[24,0,24,7],[4,1,4,4],[5,1,5,4],[6,1,6,4],[9,1,9,4],[5,7,6,7],[16,0,16,1],[32,5,32,6],[27,4,28,4],[27,5,28,6],[27,7,28,7],[25,4,25,7],[29,4,29,7],[27,1,27,2],[28,1,28,2],[29,1,29,2],[30,1,30,2],[31,1,31,2],[0,0,0,5],[1,0,1,5],[2,0,2,5],[34,1,34,2],[22,0,22,1],[17,0,17,1],[18,0,18,1],[19,0,19,1],[20,0,20,1],[21,0,21,1],[33,1,33,2],[25,0,25,3],[26,5,26,6],[30,5,30,6],[31,5,31,6],[26,1,26,2]]}
["IDRAIM"]
["sistema di valutazione IDRomorfologica, AnalisI e Monitoraggio dei Corsi d'Acqua",null,null,null,null,null,null,null,null,"VAL","IDM","CLASSE DI DINAMICA"]
[{"$f":"INQUADRAMENTO!G54","v":"Versione IDM 1.0 - Settembre 2015"},null,null,null,null,null,null,null,null,0.2,"0.0 ≤ IDM < 0.2","Molto bassa"]
[null,null,null,null,null,null,null,null,null,0.4,"0.2 ≤ IDM < 0.4","Bassa"]
[null,{"$f":"\"INDICI E CLASSI DI DINAMICA MORFOLOGICA\"","v":"INDICI E CLASSI DI DINAMICA MORFOLOGICA"},null,null,null,null,null,null,null,0.6,"0.4 ≤ IDM < 0.6","Media"]
[null,{"$f":"\"del tratto \" &GENERALITÀ!F10","v":"del tratto TR_9_3_1"},null,null,null,null,null,"CLASSE DI DINAMICA MORFOLOGICA",null,0.8,"0.6 ≤ IDM < 0.8","Elevata"]
[null,"INDICI DI DINAMICA MORFOLOGICA",null,null,null,null,"IDM",null,null,null,"0.8 ≤ IDM ≤ 1.0","Molto elevata"]
[null,"IDM","IDMmin","IDMmax","NOTE",null,"0.0 ≤ IDM < 0.2","Molto bassa"]
[null,{"$f":"CALC_INDICI!F18","v":{"$error":"#DIV/0!"}},{"$f":"CALC_INDICI!F19","v":{"$error":"#DIV/0!"}},{"$f":"CALC_INDICI!F20","v":{"$error":"#DIV/0!"}},{"$f":"(COUNTIF(D27:D32,\"N.A.\")+COUNTIF(H27:H29,\"N.A.\")+COUNTIF(H31:H33,\"N.A.\")) & \"/11 IND. N.A.\"","v":"11/11 IND. N.A."},null,"0.2 ≤ IDM < 0.4","Bassa"]
[null,"CLASSI DI DINAMICA MORFOLOGICA",null,null,null,null,"0.4 ≤ IDM < 0.6","Media"]
[null,"CLASSEmed","CLASSEmin","CLASSEmax","NOTE",null,"0.6 ≤ IDM < 0.8","Elevata"]
[null,{"$f":"IF(B9<SINTESI!$J$3,SINTESI!$L$3,IF(B9<SINTESI!$J$4,SINTESI!$L$4,IF(B9<SINTESI!$J$5,SINTESI!$L$5,IF(B9<SINTESI!$J$6,SINTESI!$L$6,SINTESI!$L$7))))","v":{"$error":"#DIV/0!"}},{"$f":"IF(C9<SINTESI!$J$3,SINTESI!$L$3,IF(C9<SINTESI!$J$4,SINTESI!$L$4,IF(C9<SINTESI!$J$5,SINTESI!$L$5,IF(C9<SINTESI!$J$6,SINTESI!$L$6,SINTESI!$L$7))))","v":{"$error":"#DIV/0!"}},{"$f":"IF(D9<SINTESI!$J$3,SINTESI!$L$3,IF(D9<SINTESI!$J$4,SINTESI!$L$4,IF(D9<SINTESI!$J$5,SINTESI!$L$5,IF(D9<SINTESI!$J$6,SINTESI!$L$6,SINTESI!$L$7))))","v":{"$error":"#DIV/0!"}},{"$f":"(COUNTIF(D27:D32,\"N.A.\")+COUNTIF(H27:H29,\"N.A.\")+COUNTIF(H31:H33,\"N.A.\")) & \"/11 IND. N.A.\"","v":"11/11 IND. N.A."},null,"0.8 ≤ IDM ≤ 1.0","Molto elevata"]
[null,"N.A. = non applicato"]
[]
[]
["SUB-INDICI"]
["NOME",null,"SIGLA","medio","minimo","massimo"]
["Morfologia e Processi",null,"IDMM",{"$f":"CALC_INDICI!$B$12","v":{"$error":"#DIV/0!"}},{"$f":"CALC_INDICI!B13","v":{"$error":"#DIV/0!"}},{"$f":"CALC_INDICI!B14","v":{"$error":"#DIV/0!"}}]
["Artificialità",null,"IDMA",{"$f":"CALC_INDICI!$D$12","v":{"$error":"#DIV/0!"}},{"$f":"CALC_INDICI!D13","v":{"$error":"#DIV/0!"}},{"$f":"CALC_INDICI!D14","v":{"$error":"#DIV/0!"}}]
["Variazioni",null,"IDMV",{"$f":"CALC_INDICI!$F$12","v":{"$error":"#DIV/0!"}},{"$f":"CALC_INDICI!F13","v":{"$error":"#DIV/0!"}},{"$f":"CALC_INDICI!F14","v":{"$error":"#DIV/0!"}}]
["Dinamica Laterale",null,"SDL",{"$f":"CALC_INDICI!C29","v":{"$error":"#DIV/0!"}},{"$f":"CALC_INDICI!C30","v":{"$error":"#DIV/0!"}},{"$f":"CALC_INDICI!C31","v":{"$error":"#DIV/0!"}}]
["Dinamica Verticale",null,"SDV",{"$f":"CALC_INDICI!G29","v":{"$error":"#DIV/0!"}},{"$f":"CALC_INDICI!G30","v":{"$error":"#DIV/0!"}},{"$f":"CALC_INDICI!G31","v":{"$error":"#DIV/0!"}}]
["Esondazione Indotta",null,"SEI",{"$f":"CALC_INDICI!K29","v":{"$error":"#VALUE!"}},{"$f":"CALC_INDICI!K31","v":{"$error":"#VALUE!"}},{"$f":"CALC_INDICI!K32","v":{"$error":"#VALUE!"}}]
[]
["SINTESI indicatori"]
["MORFOLOGIA E PROCESSI",null,null,null,"ARTIFICIALITÀ"]
[{"$f":"MORFOLOGIAePROCESSI!A5","v":"M1"},{"$f":"MORFOLOGIAePROCESSI!B5","v":"Tipologia d'alveo"},null,{"$f":"IF((VLOOKUP(A27,MORFOLOGIAePROCESSI!$N$5:$T$124,3,FALSE))>0, \"N.A.\",IF(VLOOKUP(A27,MORFOLOGIAePROCESSI!$N$5:$T$124,6,FALSE)<>(VLOOKUP(A27,MORFOLOGIAePROCESSI!$N$5:$T$124,7,FALSE)),VLOOKUP(A27,MORFOLOGIAePROCESSI!$N$5:$T$124,7,FALSE)&\"÷\"&VLOOKUP(A27,MORFOLOGIAePROCESSI!$N$5:$T$124,6,FALSE),VLOOKUP(A27,MORFOLOGIAePROCESSI!$N$5:$T$124,2,FALSE)))","v":"N.A."},{"$f":"ARTIFICIALITÀ!A5","v":"A1"},{"$f":"ARTIFICIALITÀ!B5","v":"Difese di sponda"},null,{"$f":"IF((VLOOKUP(E27,ARTIFICIALITÀ!$N$5:$T$124,3,FALSE))>0, \"N.A.\",IF(VLOOKUP(E27,ARTIFICIALITÀ!$N$5:$T$124,6,FALSE)<>(VLOOKUP(E27,ARTIFICIALITÀ!$N$5:$T$124,7,FALSE)),VLOOKUP(E27,ARTIFICIALITÀ!$N$5:$T$124,7,FALSE)&\"÷\"&VLOOKUP(E27,ARTIFICIALITÀ!$N$5:$T$124,6,FALSE),VLOOKUP(E27,ARTIFICIALITÀ!$N$5:$T$124,2,FALSE)))","v":"N.A."}]
[{"$f":"MORFOLOGIAePROCESSI!A18","v":"M2"},{"$f":"MORFOLOGIAePROCESSI!B18","v":"Erodibilità delle sponde"},null,{"$f":"IF((VLOOKUP(A28,MORFOLOGIAePROCESSI!$N$5:$T$124,3,FALSE))>0, \"N.A.\",IF(VLOOKUP(A28,MORFOLOGIAePROCESSI!$N$5:$T$124,6,FALSE)<>(VLOOKUP(A28,MORFOLOGIAePROCESSI!$N$5:$T$124,7,FALSE)),VLOOKUP(A28,MORFOLOGIAePROCESSI!$N$5:$T$124,7,FALSE)&\"÷\"&VLOOKUP(A28,MORFOLOGIAePROCESSI!$N$5:$T$124,6,FALSE),VLOOKUP(A28,MORFOLOGIAePROCESSI!$N$5:$T$124,2,FALSE)))","v":"N.A."},{"$f":"ARTIFICIALITÀ!A22","v":"A2"},{"$f":"ARTIFICIALITÀ!B22","v":"Opere di rivestimento o consolidamento del fondo"},null,{"$f":"IF((VLOOKUP(E28,ARTIFICIALITÀ!$N$5:$T$124,3,FALSE))>0, \"N.A.\",IF(VLOOKUP(E28,ARTIFICIALITÀ!$N$5:$T$124,6,FALSE)<>(VLOOKUP(E28,ARTIFICIALITÀ!$N$5:$T$124,7,FALSE)),VLOOKUP(E28,ARTIFICIALITÀ!$N$5:$T$124,7,FALSE)&\"÷\"&VLOOKUP(E28,ARTIFICIALITÀ!$N$5:$T$124,6,FALSE),VLOOKUP(E28,ARTIFICIALITÀ!$N$5:$T$124,2,FALSE)))","v":"N.A."}]
[{"$f":"MORFOLOGIAePROCESSI!A37","v":"M3"},{"$f":"MORFOLOGIAePROCESSI!B37","v":"Erodibilità del fondo"},null,{"$f":"IF((VLOOKUP(A29,MORFOLOGIAePROCESSI!$N$5:$T$124,3,FALSE))>0, \"N.A.\",IF(VLOOKUP(A29,MORFOLOGIAePROCESSI!$N$5:$T$124,6,FALSE)<>(VLOOKUP(A29,MORFOLOGIAePROCESSI!$N$5:$T$124,7,FALSE)),VLOOKUP(A29,MORFOLOGIAePROCESSI!$N$5:$T$124,7,FALSE)&\"÷\"&VLOOKUP(A29,MORFOLOGIAePROCESSI!$N$5:$T$124,6,FALSE),VLOOKUP(A29,MORFOLOGIAePROCESSI!$N$5:$T$124,2,FALSE)))","v":"N.A."}]
[{"$f":"MORFOLOGIAePROCESSI!A54","v":"M4"},{"$f":"MORFOLOGIAePROCESSI!B54","v":"Processi di arretramento delle sponde"},null,{"$f":"IF((VLOOKUP(A30,MORFOLOGIAePROCESSI!$N$5:$T$124,3,FALSE))>0, \"N.A.\",IF(VLOOKUP(A30,MORFOLOGIAePROCESSI!$N$5:$T$124,6,FALSE)<>(VLOOKUP(A30,MORFOLOGIAePROCESSI!$N$5:$T$124,7,FALSE)),VLOOKUP(A30,MORFOLOGIAePROCESSI!$N$5:$T$124,7,FALSE)&\"÷\"&VLOOKUP(A30,MORFOLOGIAePROCESSI!$N$5:$T$124,6,FALSE),VLOOKUP(A30,MORFOLOGIAePROCESSI!$N$5:$T$124,2,FALSE)))","v":"N.A."},"VARIAZIONI MORFOLOGICHE"]
[{"$f":"MORFOLOGIAePROCESSI!A69","v":"M5"},{"$f":"MORFOLOGIAePROCESSI!B69","v":"Tendenze di larghezza"},null,{"$f":"IF((VLOOKUP(A31,MORFOLOGIAePROCESSI!$N$5:$T$124,3,FALSE))>0, \"N.A.\",IF(VLOOKUP(A31,MORFOLOGIAePROCESSI!$N$5:$T$124,6,FALSE)<>(VLOOKUP(A31,MORFOLOGIAePROCESSI!$N$5:$T$124,7,FALSE)),VLOOKUP(A31,MORFOLOGIAePROCESSI!$N$5:$T$124,7,FALSE)&\"÷\"&VLOOKUP(A31,MORFOLOGIAePROCESSI!$N$5:$T$124,6,FALSE),VLOOKUP(A31,MORFOLOGIAePROCESSI!$N$5:$T$124,2,FALSE)))","v":"N.A."},{"$f":"'VARIAZIONI MORFOLOGICHE'!A5","v":"V1"},{"$f":"'VARIAZIONI MORFOLOGICHE'!B5","v":"Variazioni della configurazione morfologica"},null,{"$f":"IF((VLOOKUP(E31,'VARIAZIONI MORFOLOGICHE'!$N$5:$T$124,3,FALSE))>0, \"N.A.\",IF(VLOOKUP(E31,'VARIAZIONI MORFOLOGICHE'!$N$5:$T$124,6,FALSE)<>(VLOOKUP(E31,'VARIAZIONI MORFOLOGICHE'!$N$5:$T$124,7,FALSE)),VLOOKUP(E31,'VARIAZIONI MORFOLOGICHE'!$N$5:$T$124,7,FALSE)&\"÷\"&VLOOKUP(E31,'VARIAZIONI MORFOLOGICHE'!$N$5:$T$124,6,FALSE),VLOOKUP(E31,'VARIAZIONI MORFOLOGICHE'!$N$5:$T$124,2,FALSE)))","v":"N.A."}]
[{"$f":"MORFOLOGIAePROCESSI!A84","v":"M6"},{"$f":"MORFOLOGIAePROCESSI!B84","v":"Tendenze altimetriche"},null,{"$f":"IF((VLOOKUP(A32,MORFOLOGIAePROCESSI!$N$5:$T$124,3,FALSE))>0, \"N.A.\",IF(VLOOKUP(A32,MORFOLOGIAePROCESSI!$N$5:$T$124,6,FALSE)<>(VLOOKUP(A32,MORFOLOGIAePROCESSI!$N$5:$T$124,7,FALSE)),VLOOKUP(A32,MORFOLOGIAePROCESSI!$N$5:$T$124,7,FALSE)&\"÷\"&VLOOKUP(A32,MORFOLOGIAePROCESSI!$N$5:$T$124,6,FALSE),VLOOKUP(A32,MORFOLOGIAePROCESSI!$N$5:$T$124,2,FALSE)))","v":"N.A."},{"$f":"'VARIAZIONI MORFOLOGICHE'!A16","v":"V2"},{"$f":"'VARIAZIONI MORFOLOGICHE'!B16","v":"Variazioni di larghezza"},null,{"$f":"IF((VLOOKUP(E32,'VARIAZIONI MORFOLOGICHE'!$N$5:$T$124,3,FALSE))>0, \"N.A.\",IF(VLOOKUP(E32,'VARIAZIONI MORFOLOGICHE'!$N$5:$T$124,6,FALSE)<>(VLOOKUP(E32,'VARIAZIONI MORFOLOGICHE'!$N$5:$T$124,7,FALSE)),VLOOKUP(E32,'VARIAZIONI MORFOLOGICHE'!$N$5:$T$124,7,FALSE)&\"÷\"&VLOOKUP(E32,'VARIAZIONI MORFOLOGICHE'!$N$5:$T$124,6,FALSE),VLOOKUP(E32,'VARIAZIONI MORFOLOGICHE'!$N$5:$T$124,2,FALSE)))","v":"N.A."}]
[null,null,null,null,{"$f":"'VARIAZIONI MORFOLOGICHE'!A31","v":"V3"},{"$f":"'VARIAZIONI MORFOLOGICHE'!B31","v":"Variazioni altimetriche"},null,{"$f":"IF((VLOOKUP(E33,'VARIAZIONI MORFOLOGICHE'!$N$5:$T$124,3,FALSE))>0, \"N.A.\",IF(VLOOKUP(E33,'VARIAZIONI MORFOLOGICHE'!$N$5:$T$124,6,FALSE)<>(VLOOKUP(E33,'VARIAZIONI MORFOLOGICHE'!$N$5:$T$124,7,FALSE)),VLOOKUP(E33,'VARIAZIONI MORFOLOGICHE'!$N$5:$T$124,7,FALSE)&\"÷\"&VLOOKUP(E33,'VARIAZIONI MORFOLOGICHE'!$N$5:$T$124,6,FALSE),VLOOKUP(E33,'VARIAZIONI MORFOLOGICHE'!$N$5:$T$124,2,FALSE)))","v":"N.A."}]
[{"$f":"MORFOLOGIAePROCESSI!$A$109","v":"M5e"},{"$f":"B31& \" - Esond\"","v":"Tendenze di larghezza - Esond"},null,{"$f":"IF((VLOOKUP(A34,MORFOLOGIAePROCESSI!$N$5:$T$124,3,FALSE))>0, \"N.A.\",IF(VLOOKUP(A34,MORFOLOGIAePROCESSI!$N$5:$T$124,6,FALSE)<>(VLOOKUP(A34,MORFOLOGIAePROCESSI!$N$5:$T$124,7,FALSE)),VLOOKUP(A34,MORFOLOGIAePROCESSI!$N$5:$T$124,7,FALSE)&\"÷\"&VLOOKUP(A34,MORFOLOGIAePROCESSI!$N$5:$T$124,6,FALSE),VLOOKUP(A34,MORFOLOGIAePROCESSI!$N$5:$T$124,2,FALSE)))","v":"N.A."}]
[{"$f":"MORFOLOGIAePROCESSI!$A$124","v":"M6e"},{"$f":"B32& \" - Esond\"","v":"Tendenze altimetriche - Esond"},null,{"$f":"IF((VLOOKUP(A35,MORFOLOGIAePROCESSI!$N$5:$T$124,3,FALSE))>0, \"N.A.\",IF(VLOOKUP(A35,MORFOLOGIAePROCESSI!$N$5:$T$124,6,FALSE)<>(VLOOKUP(A35,MORFOLOGIAePROCESSI!$N$5:$T$124,7,FALSE)),VLOOKUP(A35,MORFOLOGIAePROCESSI!$N$5:$T$124,7,FALSE)&\"÷\"&VLOOKUP(A35,MORFOLOGIAePROCESSI!$N$5:$T$124,6,FALSE),VLOOKUP(A35,MORFOLOGIAePROCESSI!$N$5:$T$124,2,FALSE)))","v":"N.A."}]